Reaction Details
TargetKappa-type opioid receptor
LigandBDBM50376837
Substrate/Competitorn/a
Meas. Tech.ChEMBL_477932 (CHEMBL935623)
Ki 900±n/a nM
Citation Tidgewell, KGroer, CEHarding, WWLozama, ASchmidt, MMarquam, AHiemstra, JPartilla, JSDersch, CMRothman, RBBohn, LMPrisinzano, TE Herkinorin analogues with differential beta-arrestin-2 interactions. J Med Chem51:2421-31 (2008) 
 
Kappa-type opioid receptor
Name:Kappa-type opioid receptor
Type:G Protein-Coupled Receptor (GPCR)
Mol. Mass.:42648.76
Organism:Homo sapiens (Human)
Description:P41145
Residue:380
BDBM50376837
NameBDBM50376837
Synonyms:CHEMBL408775
TypeSmall organic molecule
Emp. Form.C28H29NO10
Mol. Mass.539.5306
SMILESCOC(=O)[C@@H]1C[C@H](OC(=O)c2ccccc2[N+]([O-])=O)C(=O)[C@H]2[C@@]1(C)CC[C@H]1C(=O)O[C@@H](C[C@]21C)c1ccoc1