Reaction Details
TargetMu-type opioid receptor
LigandBDBM50376838
Substrate/Competitorn/a
Meas. Tech.ChEMBL_477925 (CHEMBL923550)
Ki>10000±n/a nM
Citation Tidgewell, KGroer, CEHarding, WWLozama, ASchmidt, MMarquam, AHiemstra, JPartilla, JSDersch, CMRothman, RBBohn, LMPrisinzano, TE Herkinorin analogues with differential beta-arrestin-2 interactions. J Med Chem51:2421-31 (2008) 
 
Mu-type opioid receptor
Name:Mu-type opioid receptor
Type:G Protein-Coupled Receptor (GPCR)
Mol. Mass.:44789.51
Organism:Homo sapiens (Human)
Description:P35372
Residue:400
BDBM50376838
NameBDBM50376838
Synonyms:CHEMBL260809
TypeSmall organic molecule
Emp. Form.C28H29NO10
Mol. Mass.539.5306
SMILESCOC(=O)[C@@H]1C[C@H](OC(=O)c2cccc(c2)[N+]([O-])=O)C(=O)[C@H]2[C@@]1(C)CC[C@H]1C(=O)O[C@@H](C[C@]21C)c1ccoc1