Reaction Details
TargetKappa-type opioid receptor
LigandBDBM50189136
Substrate/Competitorn/a
Meas. Tech.ChEMBL_477932 (CHEMBL935623)
Ki 280±n/a nM
Citation Tidgewell, KGroer, CEHarding, WWLozama, ASchmidt, MMarquam, AHiemstra, JPartilla, JSDersch, CMRothman, RBBohn, LMPrisinzano, TE Herkinorin analogues with differential beta-arrestin-2 interactions. J Med Chem51:2421-31 (2008) 
 
Kappa-type opioid receptor
Name:Kappa-type opioid receptor
Type:G Protein-Coupled Receptor (GPCR)
Mol. Mass.:42648.76
Organism:Homo sapiens (Human)
Description:P41145
Residue:380
BDBM50189136
NameBDBM50189136
Synonyms:CHEMBL424698 | Salvinorin B
TypeSmall organic molecule
Emp. Form.C21H26O7
Mol. Mass.390.4269
SMILESCOC(=O)[C@@H]1C[C@H](O)C(=O)[C@H]2[C@@]1(C)CC[C@H]1C(=O)O[C@@H](C[C@]21C)c1ccoc1