Reaction Details
TargetPotassium voltage-gated channel subfamily H member 2
LigandBDBM50377352
Substrate/Competitorn/a
Meas. Tech.ChEMBL_479556 (CHEMBL929420)
IC50 6600±n/a nM
Citation Ruel, RThibeault, CL'Heureux, AMartel, ACai, ZWWei, DQian, LBarrish, JCMathur, AD'Arienzo, CHunt, JTKamath, AMarathe, PZhang, YDerbin, GWautlet, BMortillo, SJeyaseelan, RHenley, BTejwani, RBhide, RSTrainor, GLFargnoli, JLombardo, LJ Discovery and preclinical studies of 5-isopropyl-6-(5-methyl-1,3,4-oxadiazol-2-yl)-N-(2-methyl-1H-pyrrolo[2,3-b]pyridin-5-yl)pyrrolo[2,1-f][1,2,4]triazin-4-amine (BMS-645737), an in vivo active potent VEGFR-2 inhibitor. Bioorg Med Chem Lett18:2985-9 (2008) 
 
Potassium voltage-gated channel subfamily H member 2
Name:Potassium voltage-gated channel subfamily H member 2
Type:Multi-pass membrane protein
Mol. Mass.:126672.65
Organism:Homo sapiens (Human)
Description:Q12809
Residue:1159
BDBM50377352
NameBDBM50377352
Synonyms:BMS-645737 | CHEMBL261592
TypeSmall organic molecule
Emp. Form.C20H20N8O
Mol. Mass.388.4258
SMILESCC(C)c1c(cn2ncnc(Nc3cnc4[nH]c(C)cc4c3)c12)-c1nnc(C)o1