Reaction Details
TargetFibroblast growth factor receptor 1
LigandBDBM50377357
Substrate/Competitorn/a
Meas. Tech.ChEMBL_479560 (CHEMBL929424)
IC50 61±n/a nM
Citation Ruel, RThibeault, CL'Heureux, AMartel, ACai, ZWWei, DQian, LBarrish, JCMathur, AD'Arienzo, CHunt, JTKamath, AMarathe, PZhang, YDerbin, GWautlet, BMortillo, SJeyaseelan, RHenley, BTejwani, RBhide, RSTrainor, GLFargnoli, JLombardo, LJ Discovery and preclinical studies of 5-isopropyl-6-(5-methyl-1,3,4-oxadiazol-2-yl)-N-(2-methyl-1H-pyrrolo[2,3-b]pyridin-5-yl)pyrrolo[2,1-f][1,2,4]triazin-4-amine (BMS-645737), an in vivo active potent VEGFR-2 inhibitor. Bioorg Med Chem Lett18:2985-9 (2008) 
 
Fibroblast growth factor receptor 1
Name:Fibroblast growth factor receptor 1
Type:Receptor
Mol. Mass.:91861.70
Organism:Homo sapiens (Human)
Description:P11362
Residue:822
BDBM50377357
NameBDBM50377357
Synonyms:CHEMBL258694
TypeSmall organic molecule
Emp. Form.C19H18N8O
Mol. Mass.374.3992
SMILESCC(C)c1c(cn2ncnc(Nc3cnc4[nH]ccc4c3)c12)-c1nnc(C)o1