Reaction Details
TargetPlatelet-derived growth factor receptor beta
LigandBDBM50377352
Substrate/Competitorn/a
Meas. Tech.ChEMBL_479561 (CHEMBL929425)
IC50>2000±n/a nM
Citation Ruel, RThibeault, CL'Heureux, AMartel, ACai, ZWWei, DQian, LBarrish, JCMathur, AD'Arienzo, CHunt, JTKamath, AMarathe, PZhang, YDerbin, GWautlet, BMortillo, SJeyaseelan, RHenley, BTejwani, RBhide, RSTrainor, GLFargnoli, JLombardo, LJ Discovery and preclinical studies of 5-isopropyl-6-(5-methyl-1,3,4-oxadiazol-2-yl)-N-(2-methyl-1H-pyrrolo[2,3-b]pyridin-5-yl)pyrrolo[2,1-f][1,2,4]triazin-4-amine (BMS-645737), an in vivo active potent VEGFR-2 inhibitor. Bioorg Med Chem Lett18:2985-9 (2008) 
 
Platelet-derived growth factor receptor beta
Name:Platelet-derived growth factor receptor beta
Type:Enzyme
Mol. Mass.:123922.25
Organism:Homo sapiens (Human)
Description:P09619
Residue:1106
BDBM50377352
NameBDBM50377352
Synonyms:BMS-645737 | CHEMBL261592
TypeSmall organic molecule
Emp. Form.C20H20N8O
Mol. Mass.388.4258
SMILESCC(C)c1c(cn2ncnc(Nc3cnc4[nH]c(C)cc4c3)c12)-c1nnc(C)o1