Reaction Details
TargetProthrombin
LigandBDBM50377614
Substrate/Competitorn/a
Meas. Tech.ChEMBL_479759 (CHEMBL934691)
Ki 1.3±n/a nM
Citation Kreutter, KDLu, TLee, LGiardino, ECPatel, SHuang, HXu, GFitzgerald, MHaertlein, BJMohan, VCrysler, CEisennagel, SDasgupta, MMcMillan, MSpurlino, JCHuebert, NDMaryanoff, BETomczuk, BEDamiano, BPPlayer, MR Orally efficacious thrombin inhibitors with cyanofluorophenylacetamide as the P2 motif. Bioorg Med Chem Lett18:2865-70 (2008) 
 
Prothrombin
Name:Prothrombin
Type:Protein
Mol. Mass.:70029.57
Organism:Homo sapiens (Human)
Description:P00734
Residue:622
BDBM50377614
NameBDBM50377614
Synonyms:CHEMBL401655
TypeSmall organic molecule
Emp. Form.C19H20F3N7O3
Mol. Mass.451.4024
SMILESN\C([NH-])=[NH+]\OCCNC(=O)Cc1c(F)c(NCC(F)(F)c2cccc[n+]2[O-])ccc1C#N