Reaction Details
TargetProthrombin
LigandBDBM50377621
Substrate/Competitorn/a
Meas. Tech.ChEMBL_479759 (CHEMBL934691)
Ki 10±n/a nM
Citation Kreutter, KDLu, TLee, LGiardino, ECPatel, SHuang, HXu, GFitzgerald, MHaertlein, BJMohan, VCrysler, CEisennagel, SDasgupta, MMcMillan, MSpurlino, JCHuebert, NDMaryanoff, BETomczuk, BEDamiano, BPPlayer, MR Orally efficacious thrombin inhibitors with cyanofluorophenylacetamide as the P2 motif. Bioorg Med Chem Lett18:2865-70 (2008) 
 
Prothrombin
Name:Prothrombin
Type:Protein
Mol. Mass.:70029.57
Organism:Homo sapiens (Human)
Description:P00734
Residue:622
BDBM50377621
NameBDBM50377621
Synonyms:CHEMBL254785
TypeSmall organic molecule
Emp. Form.C20H22F3N7O2
Mol. Mass.449.4296
SMILES[#6]-c1cccnc1C(F)(F)[#6]-[#7]-c1ccc(C#N)c(-[#6]-[#6](=O)-[#7]-[#6]-[#6]-[#8]\[#7]=[#6](\[#7])-[#7])c1F