Reaction Details
TargetProthrombin
LigandBDBM50377624
Substrate/Competitorn/a
Meas. Tech.ChEMBL_479759 (CHEMBL934691)
Ki 1.8±n/a nM
Citation Kreutter, KDLu, TLee, LGiardino, ECPatel, SHuang, HXu, GFitzgerald, MHaertlein, BJMohan, VCrysler, CEisennagel, SDasgupta, MMcMillan, MSpurlino, JCHuebert, NDMaryanoff, BETomczuk, BEDamiano, BPPlayer, MR Orally efficacious thrombin inhibitors with cyanofluorophenylacetamide as the P2 motif. Bioorg Med Chem Lett18:2865-70 (2008) 
 
Prothrombin
Name:Prothrombin
Type:Protein
Mol. Mass.:70029.57
Organism:Homo sapiens (Human)
Description:P00734
Residue:622
BDBM50377624
NameBDBM50377624
Synonyms:CHEMBL403310
TypeSmall organic molecule
Emp. Form.C20H19F5N6O2
Mol. Mass.470.3959
SMILES[#7]\[#6](-[#7])=[#7]\[#8]-[#6]-[#6]-[#7]-[#6](=O)-[#6]-c1c(F)c(-[#7]-[#6]C(F)(F)c2ccc(F)c(F)c2)ccc1C#N