Reaction Details
TargetAldo-keto reductase family 1 member B1
LigandBDBM7458
Substrate/Competitorn/a
Meas. Tech.ChEMBL_533382 (CHEMBL980608)
IC50 6670±n/a nM
Citation Yoo, NHJang, DSYoo, JLLee, YMKim, YSCho, JHKim, JS Erigeroflavanone, a flavanone derivative from the flowers of Erigeron annuus with protein glycation and aldose reductase inhibitory activity. J Nat Prod71:713-5 (2008) 
 
Aldo-keto reductase family 1 member B1
Name:Aldo-keto reductase family 1 member B1
Type:PROTEIN
Mol. Mass.:35797.87
Organism:Rattus norvegicus
Description:ChEMBL_1512484
Residue:316
BDBM7458
NameBDBM7458
Synonyms:5,7-dihydroxy-2-(4-hydroxyphenyl)-4H-chromen-4-one Apigenin Apigenin (3) Apigenin, 13 Naringenin, 18 US11337935, Compound Apigenin cid_5280443 | jm5b01461, Compound 90
TypeSmall organic molecule
Emp. Form.C15H10O5
Mol. Mass.270.2369
SMILESOc1ccc(cc1)-c1cc(=O)c2c(O)cc(O)cc2o1