Reaction Details
TargetCannabinoid receptor 2
LigandBDBM50260806
Substrate/Competitorn/a
Meas. Tech.ChEMBL_556358 (CHEMBL954091)
Ki 4945±n/a nM
Citation Wustrow, DJMaynard, GDYuan, JZhao, HMao, JGuo, QKershaw, MHammer, JBrodbeck, RMNear, KEZhou, DBeers, DSChenard, BLKrause, JEHutchison, AJ Aminopyrazine CB1 receptor inverse agonists. Bioorg Med Chem Lett18:3376-81 (2008) 
 
Cannabinoid receptor 2
Name:Cannabinoid receptor 2
Type:G Protein-Coupled Receptor (GPCR)
Mol. Mass.:39690.94
Organism:Homo sapiens (Human)
Description:P34972
Residue:360
BDBM50260806
NameBDBM50260806
Synonyms:CHEMBL497557 | N-(1-(6-(3-chloropyridin-4-yl)-5-(4-(trifluoromethyl)phenyl)pyrazin-2-yl)piperidin-4-yl)isobutyramide
TypeSmall organic molecule
Emp. Form.C25H25ClF3N5O
Mol. Mass.503.947
SMILESCC(C)C(=O)NC1CCN(CC1)c1cnc(-c2ccc(cc2)C(F)(F)F)c(n1)-c1ccncc1Cl