Reaction Details
TargetCannabinoid receptor 1
LigandBDBM50260805
Substrate/Competitorn/a
Meas. Tech.ChEMBL_556337 (CHEMBL954070)
Ki 0.8±n/a nM
Citation Wustrow, DJMaynard, GDYuan, JZhao, HMao, JGuo, QKershaw, MHammer, JBrodbeck, RMNear, KEZhou, DBeers, DSChenard, BLKrause, JEHutchison, AJ Aminopyrazine CB1 receptor inverse agonists. Bioorg Med Chem Lett18:3376-81 (2008) 
 
Cannabinoid receptor 1
Name:Cannabinoid receptor 1
Type:G Protein-Coupled Receptor (GPCR)
Mol. Mass.:52868.96
Organism:Homo sapiens (Human)
Description:P21554
Residue:472
BDBM50260805
NameBDBM50260805
Synonyms:CHEMBL524804 | N-(1-(6-(3-chloropyridin-4-yl)-5-(4-(trifluoromethyl)phenyl)pyrazin-2-yl)piperidin-4-yl)propionamide
TypeSmall organic molecule
Emp. Form.C24H23ClF3N5O
Mol. Mass.489.921
SMILESCCC(=O)NC1CCN(CC1)c1cnc(-c2ccc(cc2)C(F)(F)F)c(n1)-c1ccncc1Cl