Reaction Details
TargetCannabinoid receptor 1
LigandBDBM50260768
Substrate/Competitorn/a
Meas. Tech.ChEMBL_556337 (CHEMBL954070)
Ki 0.87±n/a nM
Citation Wustrow, DJMaynard, GDYuan, JZhao, HMao, JGuo, QKershaw, MHammer, JBrodbeck, RMNear, KEZhou, DBeers, DSChenard, BLKrause, JEHutchison, AJ Aminopyrazine CB1 receptor inverse agonists. Bioorg Med Chem Lett18:3376-81 (2008) 
 
Cannabinoid receptor 1
Name:Cannabinoid receptor 1
Type:G Protein-Coupled Receptor (GPCR)
Mol. Mass.:52868.96
Organism:Homo sapiens (Human)
Description:P21554
Residue:472
BDBM50260768
NameBDBM50260768
Synonyms:1-(6-(2-chloropyridin-4-yl)-5-(4-(trifluoromethyl)phenyl)pyrazin-2-yl)-4-(ethylamino)piperidine-4-carboxamide | CHEMBL496508
TypeSmall organic molecule
Emp. Form.C24H24ClF3N6O
Mol. Mass.504.935
SMILESCCNC1(CCN(CC1)c1cnc(-c2ccc(cc2)C(F)(F)F)c(n1)-c1ccnc(Cl)c1)C(N)=O