Reaction Details
TargetLysosomal alpha-glucosidase
LigandBDBM50242271
Substrate/Competitorn/a
Meas. Tech.ChEMBL_490840 (CHEMBL993579)
IC50 1000±n/a nM
Citation Kuriyama, CKamiyama, OIkeda, KSanae, FKato, AAdachi, IImahori, TTakahata, HOkamoto, TAsano, N In vitro inhibition of glycogen-degrading enzymes and glycosidases by six-membered sugar mimics and their evaluation in cell cultures. Bioorg Med Chem16:7330-6 (2008) 
 
Lysosomal alpha-glucosidase
Name:Lysosomal alpha-glucosidase
Type:PROTEIN
Mol. Mass.:105312.45
Organism:Homo sapiens (Human)
Description:ChEMBL_1506060
Residue:952
BDBM50242271
NameBDBM50242271
Synonyms:(2R,3R,4R,5S)-1-(2-hydroxyethyl)-2-(hydroxymethyl)piperidine-3,4,5-triol BAY-M-1099 Glyset N-Hydroxyethyl-1-deoxynojirimycin | cid_441314
TypeSmall organic molecule
Emp. Form.C8H17NO5
Mol. Mass.207.2243
SMILESOCCN1C[C@H](O)[C@@H](O)[C@H](O)[C@H]1CO