Reaction Details
TargetAcetylcholinesterase
LigandBDBM50262282
Substrate/Competitorn/a
Meas. Tech.ChEMBL_514380 (CHEMBL967994)
IC50 320±n/a nM
Citation León, Rde los Ríos, CMarco-Contelles, JHuertas, OBarril, XLuque, FJLópez, MGGarcía, AGVillarroya, M New tacrine-dihydropyridine hybrids that inhibit acetylcholinesterase, calcium entry, and exhibit neuroprotection properties. Bioorg Med Chem16:7759-69 (2008) 
 
Acetylcholinesterase
Name:Acetylcholinesterase
Type:Enzyme
Mol. Mass.:71812.79
Organism:Electrophorus electricus (Electric eel)
Description:n/a
Residue:633
BDBM50262282
NameBDBM50262282
Synonyms:11-Amino-3,3-dimethyl-12-phenyl-3,4,5,7,8,9,10,12-octahydro-2H-dibenzo[b,g][1,8]naphthyridin-1-one | CHEMBL512096
TypeSmall organic molecule
Emp. Form.C24H27N3O
Mol. Mass.373.4907
SMILESCC1(C)CC(=O)C2C(c3ccccc3)c3c(N)c4CCCCc4nc3N=C2C1