Reaction Details
TargetCholinesterase
LigandBDBM29390
Substrate/Competitorn/a
Meas. Tech.ChEMBL_514382 (CHEMBL967996)
IC50>100000±n/a nM
Citation León, Rde los Ríos, CMarco-Contelles, JHuertas, OBarril, XLuque, FJLópez, MGGarcía, AGVillarroya, M New tacrine-dihydropyridine hybrids that inhibit acetylcholinesterase, calcium entry, and exhibit neuroprotection properties. Bioorg Med Chem16:7759-69 (2008) 
 
Cholinesterase
Name:Cholinesterase
Type:Homotetramer
Mol. Mass.:68422.27
Organism:Homo sapiens (Human)
Description:P06276
Residue:602
BDBM29390
NameBDBM29390
Synonyms:CHEMBL218939 | tacrine-dihydropyridine hybrid (tacripyrine), 1
TypeSmall organic molecule
Emp. Form.C22H25N3O2
Mol. Mass.363.4528
SMILESCCOC(=O)C1C(c2ccccc2)c2c(N)c3CCCCc3nc2N=C1C