Reaction Details
TargetCholinesterase
LigandBDBM50262342
Substrate/Competitorn/a
Meas. Tech.ChEMBL_514382 (CHEMBL967996)
IC50>100000±n/a nM
Citation León, Rde los Ríos, CMarco-Contelles, JHuertas, OBarril, XLuque, FJLópez, MGGarcía, AGVillarroya, M New tacrine-dihydropyridine hybrids that inhibit acetylcholinesterase, calcium entry, and exhibit neuroprotection properties. Bioorg Med Chem16:7759-69 (2008) 
 
Cholinesterase
Name:Cholinesterase
Type:Homotetramer
Mol. Mass.:68422.27
Organism:Homo sapiens (Human)
Description:P06276
Residue:602
BDBM50262342
NameBDBM50262342
Synonyms:11-Amino-3,3-dimethyl-12-pyridin-4-yl-3,4,5,7,8,9,10,12-octahydro-2H-dibenzo[b,g][1,8]naphthyridin-1-one | CHEMBL468002
TypeSmall organic molecule
Emp. Form.C23H26N4O
Mol. Mass.374.4787
SMILESCC1(C)CC(=O)C2C(c3ccncc3)c3c(N)c4CCCCc4nc3N=C2C1