Reaction Details
TargetAcetylcholinesterase
LigandBDBM50262455
Substrate/Competitorn/a
Meas. Tech.ChEMBL_514380 (CHEMBL967994)
IC50 70000±n/a nM
Citation León, Rde los Ríos, CMarco-Contelles, JHuertas, OBarril, XLuque, FJLópez, MGGarcía, AGVillarroya, M New tacrine-dihydropyridine hybrids that inhibit acetylcholinesterase, calcium entry, and exhibit neuroprotection properties. Bioorg Med Chem16:7759-69 (2008) 
 
Acetylcholinesterase
Name:Acetylcholinesterase
Type:Enzyme
Mol. Mass.:71812.79
Organism:Electrophorus electricus (Electric eel)
Description:n/a
Residue:633
BDBM50262455
NameBDBM50262455
Synonyms:11-Amino-12-(4-fluoro-phenyl)-3,3-dimethyl-2,3,4,7,8,9,10,12-octahydro-5-oxa-6-aza-naphthacen-1-one | CHEMBL514858
TypeSmall organic molecule
Emp. Form.C24H25FN2O2
Mol. Mass.392.4659
SMILESCC1(C)CC(=O)C2=C(C1)Oc1nc3CCCCc3c(N)c1C2c1ccc(F)cc1