Reaction Details
TargetAcetylcholinesterase
LigandBDBM31904
Substrate/Competitorn/a
Meas. Tech.ChEMBL_514384 (CHEMBL970795)
Ki 6800±n/a nM
Citation León, Rde los Ríos, CMarco-Contelles, JHuertas, OBarril, XLuque, FJLópez, MGGarcía, AGVillarroya, M New tacrine-dihydropyridine hybrids that inhibit acetylcholinesterase, calcium entry, and exhibit neuroprotection properties. Bioorg Med Chem16:7759-69 (2008) 
 
Acetylcholinesterase
Name:Acetylcholinesterase
Type:Enzyme
Mol. Mass.:71812.79
Organism:Electrophorus electricus (Electric eel)
Description:n/a
Residue:633
BDBM31904
NameBDBM31904
Synonyms:CHEMBL345124 Propidium Iodide, 2 | propidium iodide
TypeSmall organic molecule
Emp. Form.C27H34N4
Mol. Mass.414.5846
SMILESCC[N+](C)(CC)CCCn1c(-c2ccccc2)c2cc(N)ccc2c2ccc(=[NH2+])cc12