Reaction Details
TargetCannabinoid receptor 1
LigandBDBM50272430
Substrate/Competitorn/a
Meas. Tech.ChEMBL_510483 (CHEMBL1006424)
EC50 1600±n/a nM
Citation Cheng, YAlbrecht, BKBrown, JBuchanan, JLBuckner, WHDiMauro, EFEmkey, RFremeau, RTHarmange, JCHoffman, BJHuang, LHuang, MLee, JHLin, FFMartin, MWNguyen, HQPatel, VFTomlinson, SAWhite, RDXia, XHitchcock, SA Discovery and optimization of a novel series of N-arylamide oxadiazoles as potent, highly selective and orally bioavailable cannabinoid receptor 2 (CB2) agonists. J Med Chem51:5019-34 (2008) 
 
Cannabinoid receptor 1
Name:Cannabinoid receptor 1
Type:G Protein-Coupled Receptor (GPCR)
Mol. Mass.:52856.55
Organism:Rattus norvegicus (rat)
Description:P20272
Residue:473
BDBM50272430
NameBDBM50272430
Synonyms:3-(4-(3-(2-Chloro-4-fluorophenyl)-1,2,4-oxadiazol-5-yl)butyl)quinoline | CHEMBL498470
TypeSmall organic molecule
Emp. Form.C21H17ClFN3O
Mol. Mass.381.831
SMILESFc1ccc(-c2noc(CCCCc3ccc4ncccc4c3)n2)c(Cl)c1