Reaction Details
Target11-beta-hydroxysteroid dehydrogenase 1
LigandBDBM28365
Substrate/Competitorn/a
Meas. Tech.ChEMBL_487343 (CHEMBL1021869)
IC50 1.3±n/a nM
Citation Julian, LDWang, ZBostick, TCaille, SChoi, RDeGraffenreid, MDi, YHe, XHungate, RWJaen, JCLiu, JMonshouwer, MMcMinn, DRew, YSudom, ASun, DTu, HUrsu, SWalker, NYan, XYe, QPowers, JP Discovery of novel, potent benzamide inhibitors of 11beta-hydroxysteroid dehydrogenase type 1 (11beta-HSD1) exhibiting oral activity in an enzyme inhibition ex vivo model. J Med Chem51:3953-60 (2008) 
 
11-beta-hydroxysteroid dehydrogenase 1
Name:11-beta-hydroxysteroid dehydrogenase 1
Type:Enzyme
Mol. Mass.:32409.16
Organism:Homo sapiens (Human)
Description:P28845
Residue:292
BDBM28365
NameBDBM28365
Synonyms:CHEMBL512355 cyclohexyl benzamide derivative, 4
TypeSmall organic molecule
Emp. Form.C22H27F3N2O2
Mol. Mass.408.4572
SMILESC[C@](O)(c1ccc(cc1)C(=O)N(C1CC1)[C@H]1CC[C@H](CCC#N)CC1)C(F)(F)F