Reaction Details
TargetTyrosine-protein phosphatase non-receptor type 1
LigandBDBM50253053
Substrate/Competitorn/a
Meas. Tech.ChEMBL_539060 (CHEMBL1036591)
IC50 10900±n/a nM
Citation Thuong, PTLee, CHDao, TTNguyen, PHKim, WGLee, SJOh, WK Triterpenoids from the leaves of Diospyros kaki (persimmon) and their inhibitory effects on protein tyrosine phosphatase 1B. J Nat Prod71:1775-8 (2008) 
 
Tyrosine-protein phosphatase non-receptor type 1
Name:Tyrosine-protein phosphatase non-receptor type 1
Type:Protein phosphatase
Mol. Mass.:49963.76
Organism:Homo sapiens (Human)
Description:Human recombinant GST-fusion PTP1B (1-435).
Residue:435
BDBM50253053
NameBDBM50253053
Synonyms:CHEMBL493908 | rotungenic acid
TypeSmall organic molecule
Emp. Form.C30H48O5
Mol. Mass.488.6991
SMILESC[C@@H]1CC[C@@]2(CC[C@]3(C)C(=CC[C@@H]4[C@@]5(C)CC[C@H](O)[C@](C)(CO)[C@@H]5CC[C@@]34C)[C@@H]2[C@]1(C)O)C(O)=O