Reaction Details
TargetMitogen-activated protein kinase 3
LigandBDBM5718
Substrate/Competitorn/a
Meas. Tech.ChEMBL_518602 (CHEMBL960395)
IC50 25000±n/a nM
Citation Triola, GWetzel, SEllinger, BKoch, MAHübel, KRauh, DWaldmann, H ATP competitive inhibitors of D-alanine-D-alanine ligase based on protein kinase inhibitor scaffolds. Bioorg Med Chem17:1079-87 (2009) 
 
Mitogen-activated protein kinase 3
Name:Mitogen-activated protein kinase 3
Type:Protein
Mol. Mass.:43136.58
Organism:Homo sapiens (Human)
Description:curated by PDB 4QTB
Residue:379
BDBM5718
NameBDBM5718
Synonyms:2,6,9-Trisubstituted purine deriv. 26 2-{[6-(benzylamino)-9-methyl-9H-purin-2-yl]amino}ethanol CHEMBL280074 purine deriv. 5
TypeSmall organic molecule
Emp. Form.C15H18N6O
Mol. Mass.298.343
SMILESCn1cnc2c(NCc3ccccc3)nc(NCCO)nc12