Reaction Details
TargetMAP kinase-activated protein kinase 2
LigandBDBM50193995
Substrate/Competitorn/a
Meas. Tech.ChEMBL_542076 (CHEMBL1016945)
IC50>10000±n/a nM
Citation Changelian, PSFlanagan, MEBall, DJKent, CRMagnuson, KSMartin, WHRizzuti, BJSawyer, PSPerry, BDBrissette, WHMcCurdy, SPKudlacz, EMConklyn, MJElliott, EAKoslov, ERFisher, MBStrelevitz, TJYoon, KWhipple, DASun, JMunchhof, MJDoty, JLCasavant, JMBlumenkopf, TAHines, MBrown, MFLillie, BMSubramanyam, CShang-Poa, CMilici, AJBeckius, GEMoyer, JDSu, CWoodworth, TGGaweco, ASBeals, CRLittman, BHFisher, DASmith, JFZagouras, PMagna, HASaltarelli, MJJohnson, KSNelms, LFDes Etages, SGHayes, LSKawabata, TTFinco-Kent, DBaker, DLLarson, MSi, MSPaniagua, RHiggins, JHolm, BReitz, BZhou, YJMorris, REO'Shea, JJBorie, DC Prevention of organ allograft rejection by a specific Janus kinase 3 inhibitor. Science302:875-878 (2003) 
 
MAP kinase-activated protein kinase 2
Name:MAP kinase-activated protein kinase 2
Type:Serine/threonine-protein kinase
Mol. Mass.:45579.87
Organism:Homo sapiens (Human)
Description:P49137
Residue:400
BDBM50193995
NameBDBM50193995
Synonyms:3-((3R,4R)-4-methyl-3-(methyl(7H-pyrrolo[2,3-d]pyrimidin-4-yl)amino)piperidin-1-yl)-3-oxopropanenitrile 3-{(3R,4R)-4-methyl-3-[methyl(7H-pyrrolo[2,3-d]pyrimidin-4-yl)amino]piperidin-1-yl}-3-oxopropanenitrile CP-690550 Tofacitinib US10112907, Example 00035 US10766894, Compound TABLE 1.20 US11078206, Example Tofacitinib US11339167, Example Tofacitinib
TypeSmall organic molecule
Emp. Form.C16H20N6O
Mol. Mass.312.3696
SMILESC[C@@H]1CCN(C[C@@H]1N(C)c1ncnc2[nH]ccc12)C(=O)CC#N