Reaction Details
TargetRenin
LigandBDBM50259463
Substrate/Competitorn/a
Meas. Tech.ChEMBL_501175 (CHEMBL975288)
IC50 2.3±n/a nM
Citation Bezençon, OBur, DWeller, TRichard-Bildstein, SRemen, LSifferlen, TCorminboeuf, OGrisostomi, CBoss, CPrade, LDelahaye, STreiber, AStrickner, PBinkert, CHess, PSteiner, BFischli, W Design and preparation of potent, nonpeptidic, bioavailable renin inhibitors. J Med Chem52:3689-702 (2009) 
 
Renin
Name:Renin
Type:Enzyme
Mol. Mass.:45058.99
Organism:Homo sapiens (Human)
Description:n/a
Residue:406
BDBM50259463
NameBDBM50259463
Synonyms:(rac)-7-(4-{2-[Methyl-(2,3,6-trichloro-benzyl)-amino]-ethyl}-phenyl)-3,9-diazabicyclo[3.3.1]non-6-ene-6-carboxylic acid cyclopropyl-(3-methoxy-2-methyl-benzyl)-amide | CHEMBL446741
TypeSmall organic molecule
Emp. Form.C36H41Cl3N4O2
Mol. Mass.668.095
SMILESCOc1cccc(CN(C2CC2)C(=O)C2=C(CC3CNCC2N3)c2ccc(CCN(C)Cc3c(Cl)ccc(Cl)c3Cl)cc2)c1C