Reaction Details
TargetRenin
LigandBDBM50259462
Substrate/Competitorn/a
Meas. Tech.ChEMBL_501175 (CHEMBL975288)
IC50 2.9±n/a nM
Citation Bezençon, OBur, DWeller, TRichard-Bildstein, SRemen, LSifferlen, TCorminboeuf, OGrisostomi, CBoss, CPrade, LDelahaye, STreiber, AStrickner, PBinkert, CHess, PSteiner, BFischli, W Design and preparation of potent, nonpeptidic, bioavailable renin inhibitors. J Med Chem52:3689-702 (2009) 
 
Renin
Name:Renin
Type:Enzyme
Mol. Mass.:45058.99
Organism:Homo sapiens (Human)
Description:n/a
Residue:406
BDBM50259462
NameBDBM50259462
Synonyms:(rac)-(1RS,5SR)-7-(4-{[(2-Chloro-3,6-difluoro-benzyl)-methyl-amino]-methyl}-phenyl)-3,9-diaza-bicyclo[3.3.1]non-6-ene-6-carboxylic acid cyclopropyl-(3-methoxy-2-methyl-benzyl)-amide | CHEMBL451603
TypeSmall organic molecule
Emp. Form.C35H39ClF2N4O2
Mol. Mass.621.16
SMILESCOc1cccc(CN(C2CC2)C(=O)C2=C(CC3CNCC2N3)c2ccc(CN(C)Cc3c(F)ccc(F)c3Cl)cc2)c1C