Reaction Details
TargetRenin
LigandBDBM50259460
Substrate/Competitorn/a
Meas. Tech.ChEMBL_501175 (CHEMBL975288)
IC50 1.8±n/a nM
Citation Bezençon, OBur, DWeller, TRichard-Bildstein, SRemen, LSifferlen, TCorminboeuf, OGrisostomi, CBoss, CPrade, LDelahaye, STreiber, AStrickner, PBinkert, CHess, PSteiner, BFischli, W Design and preparation of potent, nonpeptidic, bioavailable renin inhibitors. J Med Chem52:3689-702 (2009) 
 
Renin
Name:Renin
Type:Enzyme
Mol. Mass.:45058.99
Organism:Homo sapiens (Human)
Description:n/a
Residue:406
BDBM50259460
NameBDBM50259460
Synonyms:(rac)-(1RS,5SR)-3-(2-Hydroxy-acetyl)-7-{4-[3-(2,3,6-trifluoro-phenoxy)-propyl]-phenyl}-3,9-diaza-bicyclo[3.3.1]non-6-ene-6-carboxylic acid(2-chloro-benzyl)-cyclopropyl-amide | CHEMBL452191
TypeSmall organic molecule
Emp. Form.C35H35ClF3N3O4
Mol. Mass.654.118
SMILESOCC(=O)N1CC2CC(=C(C(C1)N2)C(=O)N(Cc1ccccc1Cl)C1CC1)c1ccc(CCCOc2c(F)ccc(F)c2F)cc1