Reaction Details
TargetRenin
LigandBDBM50259450
Substrate/Competitorn/a
Meas. Tech.ChEMBL_501175 (CHEMBL975288)
IC50 6.6±n/a nM
Citation Bezençon, OBur, DWeller, TRichard-Bildstein, SRemen, LSifferlen, TCorminboeuf, OGrisostomi, CBoss, CPrade, LDelahaye, STreiber, AStrickner, PBinkert, CHess, PSteiner, BFischli, W Design and preparation of potent, nonpeptidic, bioavailable renin inhibitors. J Med Chem52:3689-702 (2009) 
 
Renin
Name:Renin
Type:Enzyme
Mol. Mass.:45058.99
Organism:Homo sapiens (Human)
Description:n/a
Residue:406
BDBM50259450
NameBDBM50259450
Synonyms:(1R,5S)-3-Acetyl-7-{4-[2-(2-methoxy-phenoxy)-ethoxy]-phenyl}-3,9-diaza-bicyclo[3.3.1]non-6-ene-6-carboxylic acid cyclopropyl-(2,3-dichloro-benzyl)-amide | CHEMBL510822
TypeSmall organic molecule
Emp. Form.C35H37Cl2N3O5
Mol. Mass.650.591
SMILESCOc1ccccc1OCCOc1ccc(cc1)C1=C([C@H]2CN(C[C@@H](C1)N2)C(C)=O)C(=O)N(Cc1cccc(Cl)c1Cl)C1CC1