Reaction Details
TargetRenin
LigandBDBM50259447
Substrate/Competitorn/a
Meas. Tech.ChEMBL_501175 (CHEMBL975288)
IC50 4.9±n/a nM
Citation Bezençon, OBur, DWeller, TRichard-Bildstein, SRemen, LSifferlen, TCorminboeuf, OGrisostomi, CBoss, CPrade, LDelahaye, STreiber, AStrickner, PBinkert, CHess, PSteiner, BFischli, W Design and preparation of potent, nonpeptidic, bioavailable renin inhibitors. J Med Chem52:3689-702 (2009) 
 
Renin
Name:Renin
Type:Enzyme
Mol. Mass.:45058.99
Organism:Homo sapiens (Human)
Description:n/a
Residue:406
BDBM50259447
NameBDBM50259447
Synonyms:(1R,5S)-3-Acetyl-7-{4-[2-(2-chloro-phenoxy)-ethoxy]-phenyl}-3,9-diaza-bicyclo[3.3.1]non-6-ene-6-carboxylic acid cyclopropyl-(2,3-dichloro-benzyl)-amide | CHEMBL470878
TypeSmall organic molecule
Emp. Form.C34H34Cl3N3O4
Mol. Mass.655.01
SMILESCC(=O)N1C[C@H]2CC(=C([C@@H](C1)N2)C(=O)N(Cc1cccc(Cl)c1Cl)C1CC1)c1ccc(OCCOc2ccccc2Cl)cc1