Reaction Details
TargetRenin
LigandBDBM50259430
Substrate/Competitorn/a
Meas. Tech.ChEMBL_501175 (CHEMBL975288)
IC50 5.2±n/a nM
Citation Bezençon, OBur, DWeller, TRichard-Bildstein, SRemen, LSifferlen, TCorminboeuf, OGrisostomi, CBoss, CPrade, LDelahaye, STreiber, AStrickner, PBinkert, CHess, PSteiner, BFischli, W Design and preparation of potent, nonpeptidic, bioavailable renin inhibitors. J Med Chem52:3689-702 (2009) 
 
Renin
Name:Renin
Type:Enzyme
Mol. Mass.:45058.99
Organism:Homo sapiens (Human)
Description:n/a
Residue:406
BDBM50259430
NameBDBM50259430
Synonyms:(1R,5S)-3-Acetyl-7-{4-[3-(2-methoxy-benzyloxy)-propoxy]-phenyl}-3,9-diaza-bicyclo[3.3.1]non-6-ene-6-carboxylic acid(4-chloro-benzyl)-cyclopropyl-amide | CHEMBL507083
TypeSmall organic molecule
Emp. Form.C37H42ClN3O5
Mol. Mass.644.199
SMILESCOc1ccccc1COCCCOc1ccc(cc1)C1=C([C@H]2CN(C[C@@H](C1)N2)C(C)=O)C(=O)N(Cc1ccc(Cl)cc1)C1CC1