Reaction Details
TargetRenin
LigandBDBM50259419
Substrate/Competitorn/a
Meas. Tech.ChEMBL_501175 (CHEMBL975288)
IC50 4.8±n/a nM
Citation Bezençon, OBur, DWeller, TRichard-Bildstein, SRemen, LSifferlen, TCorminboeuf, OGrisostomi, CBoss, CPrade, LDelahaye, STreiber, AStrickner, PBinkert, CHess, PSteiner, BFischli, W Design and preparation of potent, nonpeptidic, bioavailable renin inhibitors. J Med Chem52:3689-702 (2009) 
 
Renin
Name:Renin
Type:Enzyme
Mol. Mass.:45058.99
Organism:Homo sapiens (Human)
Description:n/a
Residue:406
BDBM50259419
NameBDBM50259419
Synonyms:(1R,5S)-7-{4-[3-(2-Methoxy-benzyloxy)-propoxy]-phenyl}-3-phenylmethanesulfonyl-3,9-diazabicyclo[3.3.1]non-6-ene-6-carboxylic acid(2-chloro-benzyl)-methyl-amide | CHEMBL508748
TypeSmall organic molecule
Emp. Form.C40H44ClN3O6S
Mol. Mass.730.312
SMILESCOc1ccccc1COCCCOc1ccc(cc1)C1=C([C@H]2CN(C[C@@H](C1)N2)S(=O)(=O)Cc1ccccc1)C(=O)N(C)Cc1ccccc1Cl