Reaction Details
TargetPeroxisome proliferator-activated receptor gamma
LigandBDBM28681
Substrate/Competitorn/a
Meas. Tech.ChEMBL_582389 (CHEMBL1063426)
EC50 50±n/a nM
Citation Ye, YLZhou, ZZou, HJShen, YXu, TFTang, JYin, HZChen, MLLeng, YShen, JH Discovery of novel dual functional agent as PPARgamma agonist and 11beta-HSD1 inhibitor for the treatment of diabetes. Bioorg Med Chem17:5722-32 (2009) 
 
Peroxisome proliferator-activated receptor gamma
Name:Peroxisome proliferator-activated receptor gamma
Type:Nuclear Receptor
Mol. Mass.:57613.46
Organism:Homo sapiens (Human)
Description:P37231
Residue:505
BDBM28681
NameBDBM28681
Synonyms:5-[(4-{2-[methyl(pyridin-2-yl)amino]ethoxy}phenyl)methyl]-1,3-thiazolidine-2,4-dione BRL 49653 CHEMBL121 [3H]rosiglitazone rosiglitazone
Typeradiolabeled ligand
Emp. Form.C18H19N3O3S
Mol. Mass.357.427
SMILESCN(CCOc1ccc(Cc2sc(=O)[nH]c2O)cc1)c1ccccn1