Reaction Details
TargetCyclin-dependent kinase 1
LigandBDBM50197834
Substrate/Competitorn/a
Meas. Tech.ChEMBL_608663 (CHEMBL1067149)
IC50 200±n/a nM
Citation Hegde, VRBorges, SPu, HPatel, MGullo, VPWu, BKirschmeier, PWilliams, MJMadison, VFischmann, TChan, TM Semi-synthetic aristolactams--inhibitors of CDK2 enzyme. Bioorg Med Chem Lett20:1384-7 (2010) 
 
Cyclin-dependent kinase 1
Name:Cyclin-dependent kinase 1
Type:Enzyme Subunit
Mol. Mass.:34101.08
Organism:Homo sapiens (Human)
Description:P06493
Residue:297
BDBM50197834
NameBDBM50197834
Synonyms:2,9-dihydroxy-1-methoxydibenzo[cd,f]indol-4(5H)-one SCH-546909 aristololactam A IIIa
TypeSmall organic molecule
Emp. Form.C16H11NO4
Mol. Mass.281.2628
SMILESCOc1c(O)cc2C(=O)Nc3cc4ccc(O)cc4c1c23