Reaction Details
TargetCyclin-dependent kinase 2
LigandBDBM50306854
Substrate/Competitorn/a
Meas. Tech.ChEMBL_608662 (CHEMBL1067148)
IC50>20000±n/a nM
Citation Hegde, VRBorges, SPu, HPatel, MGullo, VPWu, BKirschmeier, PWilliams, MJMadison, VFischmann, TChan, TM Semi-synthetic aristolactams--inhibitors of CDK2 enzyme. Bioorg Med Chem Lett20:1384-7 (2010) 
 
Cyclin-dependent kinase 2
Name:Cyclin-dependent kinase 2
Type:Enzyme Subunit
Mol. Mass.:33938.17
Organism:Homo sapiens (Human)
Description:P24941
Residue:298
BDBM50306854
NameBDBM50306854
Synonyms:CHEMBL602280 | aristolochic acid II
TypeSmall organic molecule
Emp. Form.C16H9NO6
Mol. Mass.311.2458
SMILESOC(=O)c1cc2OCOc2c2c3ccccc3cc([N+]([O-])=O)c12