Reaction Details
TargetCyclin-dependent kinase 2
LigandBDBM50306864
Substrate/Competitorn/a
Meas. Tech.ChEMBL_608662 (CHEMBL1067148)
IC50 18000±n/a nM
Citation Hegde, VRBorges, SPu, HPatel, MGullo, VPWu, BKirschmeier, PWilliams, MJMadison, VFischmann, TChan, TM Semi-synthetic aristolactams--inhibitors of CDK2 enzyme. Bioorg Med Chem Lett20:1384-7 (2010) 
 
Cyclin-dependent kinase 2
Name:Cyclin-dependent kinase 2
Type:Enzyme Subunit
Mol. Mass.:33938.17
Organism:Homo sapiens (Human)
Description:P24941
Residue:298
BDBM50306864
NameBDBM50306864
Synonyms:9-chloro-3,4-dihydroxy-10-nitrophenanthrene-1-carboxylic acid | CHEMBL600387
TypeSmall organic molecule
Emp. Form.C15H8ClNO6
Mol. Mass.333.68
SMILESOC(=O)c1cc(O)c(O)c2c1c(c(Cl)c1ccccc21)[N+]([O-])=O