Reaction Details
TargetCyclin-dependent kinase 2
LigandBDBM50306868
Substrate/Competitorn/a
Meas. Tech.ChEMBL_608662 (CHEMBL1067148)
IC50 15000±n/a nM
Citation Hegde, VRBorges, SPu, HPatel, MGullo, VPWu, BKirschmeier, PWilliams, MJMadison, VFischmann, TChan, TM Semi-synthetic aristolactams--inhibitors of CDK2 enzyme. Bioorg Med Chem Lett20:1384-7 (2010) 
 
Cyclin-dependent kinase 2
Name:Cyclin-dependent kinase 2
Type:Enzyme Subunit
Mol. Mass.:33938.17
Organism:Homo sapiens (Human)
Description:P24941
Residue:298
BDBM50306868
NameBDBM50306868
Synonyms:6H-Benzo[f][1,3]dioxolo[4',5':4,5]benzo[1,2,3-cd]indol-5-one | CHEMBL603073
TypeSmall organic molecule
Emp. Form.C16H9NO3
Mol. Mass.263.2476
SMILESO=C1Nc2cc3ccccc3c3c4OCOc4cc1c23