Reaction Details
TargetCyclin-dependent kinase 2
LigandBDBM50306870
Substrate/Competitorn/a
Meas. Tech.ChEMBL_608662 (CHEMBL1067148)
IC50>15000±n/a nM
Citation Hegde, VRBorges, SPu, HPatel, MGullo, VPWu, BKirschmeier, PWilliams, MJMadison, VFischmann, TChan, TM Semi-synthetic aristolactams--inhibitors of CDK2 enzyme. Bioorg Med Chem Lett20:1384-7 (2010) 
 
Cyclin-dependent kinase 2
Name:Cyclin-dependent kinase 2
Type:Enzyme Subunit
Mol. Mass.:33938.17
Organism:Homo sapiens (Human)
Description:P24941
Residue:298
BDBM50306870
NameBDBM50306870
Synonyms:8,9-Dimethoxy-6H-benzo[f][1,3]dioxolo[4',5':4,5]benzo[1,2,3-cd]indol-5-one | CHEMBL605632
TypeSmall organic molecule
Emp. Form.C18H13NO5
Mol. Mass.323.2995
SMILESCOc1ccc2c(cc3NC(=O)c4cc5OCOc5c2c34)c1OC