Reaction Details
TargetCyclin-dependent kinase 2
LigandBDBM50306880
Substrate/Competitorn/a
Meas. Tech.ChEMBL_608662 (CHEMBL1067148)
IC50>35000±n/a nM
Citation Hegde, VRBorges, SPu, HPatel, MGullo, VPWu, BKirschmeier, PWilliams, MJMadison, VFischmann, TChan, TM Semi-synthetic aristolactams--inhibitors of CDK2 enzyme. Bioorg Med Chem Lett20:1384-7 (2010) 
 
Cyclin-dependent kinase 2
Name:Cyclin-dependent kinase 2
Type:Enzyme Subunit
Mol. Mass.:33938.17
Organism:Homo sapiens (Human)
Description:P24941
Residue:298
BDBM50306880
NameBDBM50306880
Synonyms:1,2-Dihydroxy-5H-dibenzo[cd,f]indol-4-one | CHEMBL604806
TypeSmall organic molecule
Emp. Form.C15H9NO3
Mol. Mass.251.2369
SMILESOc1cc2C(=O)Nc3cc4ccccc4c(c1O)c23