Reaction Details
TargetCyclin-dependent kinase 2
LigandBDBM50306885
Substrate/Competitorn/a
Meas. Tech.ChEMBL_608662 (CHEMBL1067148)
IC50>50000±n/a nM
Citation Hegde, VRBorges, SPu, HPatel, MGullo, VPWu, BKirschmeier, PWilliams, MJMadison, VFischmann, TChan, TM Semi-synthetic aristolactams--inhibitors of CDK2 enzyme. Bioorg Med Chem Lett20:1384-7 (2010) 
 
Cyclin-dependent kinase 2
Name:Cyclin-dependent kinase 2
Type:Enzyme Subunit
Mol. Mass.:33938.17
Organism:Homo sapiens (Human)
Description:P24941
Residue:298
BDBM50306885
NameBDBM50306885
Synonyms:CHEMBL464748 | Dicentrine
TypeSmall organic molecule
Emp. Form.C20H21NO4
Mol. Mass.339.385
SMILESCOc1cc2C[C@@H]3N(C)CCc4cc5OCOc5c(-c2cc1OC)c34