Reaction Details
TargetCyclin-dependent kinase 2
LigandBDBM50306886
Substrate/Competitorn/a
Meas. Tech.ChEMBL_608662 (CHEMBL1067148)
IC50>50000±n/a nM
Citation Hegde, VRBorges, SPu, HPatel, MGullo, VPWu, BKirschmeier, PWilliams, MJMadison, VFischmann, TChan, TM Semi-synthetic aristolactams--inhibitors of CDK2 enzyme. Bioorg Med Chem Lett20:1384-7 (2010) 
 
Cyclin-dependent kinase 2
Name:Cyclin-dependent kinase 2
Type:Enzyme Subunit
Mol. Mass.:33938.17
Organism:Homo sapiens (Human)
Description:P24941
Residue:298
BDBM50306886
NameBDBM50306886
Synonyms:CHEMBL602275 | Roemerine-HBr
TypeSmall organic molecule
Emp. Form.C18H17NO2
Mol. Mass.279.3331
SMILESCN1CCc2cc3OCOc3c3-c4ccccc4C[C@@H]1c23