Reaction Details
TargetHeparanase
LigandBDBM50307389
Substrate/Competitorn/a
Meas. Tech.ChEMBL_610684 (CHEMBL1072345)
Kd 360±n/a nM
Citation Johnstone, KDKaroli, TLiu, LDredge, KCopeman, ELi, CPDavis, KHammond, EBytheway, IKostewicz, EChiu, FCShackleford, DMCharman, SACharman, WNHarenberg, JGonda, TJFerro, V Synthesis and biological evaluation of polysulfated oligosaccharide glycosides as inhibitors of angiogenesis and tumor growth. J Med Chem53:1686-99 (2010) 
 
Heparanase
Name:Heparanase
Type:PROTEIN
Mol. Mass.:61167.67
Organism:Homo sapiens (Human)
Description:ChEMBL_327900
Residue:543
BDBM50307389
NameBDBM50307389
Synonyms:2,3,4,6-Tetra-O-sulfo-alpha-D-mannopyranosyl-(1->3)-2,4,6-tri-O-sulfo-alpha-D-mannopyranosyl-(1->3)-2,4,6-tri-O-sulfo-alpha-D-mannopyranosyl-(1->3)-2,4,6-tri-O-sulfo-alpha-D-mannopyranosyl-(1->2)-3,4,6-tri-O-sulfor-D-mannopyranoside | CHEMBL590011
TypeSmall organic molecule
Emp. Form.C50H59N3O74S16
Mol. Mass.2399.028
SMILES[O-]S(=O)(=O)OC[C@H]1O[C@H](OCCCCCCCCn2cc(nn2)-c2cccc3ccccc23)[C@@H](O[C@H]2O[C@H](COS([O-])(=O)=O)[C@@H](OS([O-])(=O)=O)[C@H](O[C@H]3O[C@H](COS([O-])(=O)=O)[C@@H](OS([O-])(=O)=O)[C@H](O[C@H]4O[C@H](COS([O-])(=O)=O)[C@@H](OS([O-])(=O)=O)[C@H](O[C@H]5O[C@H](COS([O-])(=O)=O)[C@@H](OS([O-])(=O)=O)[C@H](OS([O-])(=O)=O)[C@@H]5OS([O-])(=O)=O)[C@@H]4OS([O-])(=O)=O)[C@@H]3OS([O-])(=O)=O)[C@@H]2OS([O-])(=O)=O)[C@@H](OS([O-])(=O)=O)[C@@H]1OS([O-])(=O)=O