Reaction Details
TargetMitogen-activated protein kinase 14
LigandBDBM50310986
Substrate/Competitorn/a
Meas. Tech.ChEMBL_618897 (CHEMBL1101788)
IC50 55±n/a nM
Citation Selness, SRDevraj, RVMonahan, JBBoehm, TLWalker, JKDevadas, BDurley, RCKurumbail, RShieh, HXing, LHepperle, MRucker, PVJerome, KDBenson, AGMarrufo, LDMadsen, HMHitchcock, JOwen, TJChristie, LPromo, MAHickory, BSAlvira, ENaing, WBlevis-Bal, R Discovery of N-substituted pyridinones as potent and selective inhibitors of p38 kinase. Bioorg Med Chem Lett19:5851-6 (2009) 
 
Mitogen-activated protein kinase 14
Name:Mitogen-activated protein kinase 14
Type:Serine/threonine-protein kinase
Mol. Mass.:41286.76
Organism:Homo sapiens (Human)
Description:Q16539
Residue:360
BDBM50310986
NameBDBM50310986
Synonyms:CHEMBL1078667 | N-(4-((3-chloro-4-(2,4-difluorobenzyloxy)-6-methyl-2-oxopyridin-1(2H)-yl)methyl)benzyl)-2-hydroxyacetamide
TypeSmall organic molecule
Emp. Form.C23H21ClF2N2O4
Mol. Mass.462.874
SMILESCc1cc(OCc2ccc(F)cc2F)c(Cl)c(=O)n1Cc1ccc(CNC(=O)CO)cc1