Reaction Details
TargetMacrophage-stimulating protein receptor
LigandBDBM50313604
Substrate/Competitorn/a
Meas. Tech.ChEMBL_614231 (CHEMBL1106059)
IC50>10000±n/a nM
Citation Choi, SJMoon, MJLee, SDChoi, SUHan, SYKim, YC Indirubin derivatives as potent FLT3 inhibitors with anti-proliferative activity of acute myeloid leukemic cells. Bioorg Med Chem Lett20:2033-7 (2010) 
 
Macrophage-stimulating protein receptor
Name:Macrophage-stimulating protein receptor
Type:Protein
Mol. Mass.:152270.76
Organism:Homo sapiens (Human)
Description:Q04912
Residue:1400
BDBM50313604
NameBDBM50313604
Synonyms:5'-Fluoro-1H,1'H-[2,3']biindolylidene-3,2'-dione 3-oxime | CHEMBL1077291
TypeSmall organic molecule
Emp. Form.C16H10FN3O2
Mol. Mass.295.2679
SMILESFc1ccc2NC(=O)C(c2c1)c1[nH]c2ccccc2c1N=O