Reaction Details
TargetHistamine H1 receptor
LigandBDBM50314274
Substrate/Competitorn/a
Meas. Tech.ChEMBL_624292 (CHEMBL1106977)
Ki 2.9±n/a nM
Citation Moree, WJJovic, FCoon, TYu, JLi, BFTucci, FCMarinkovic, DGross, RSMalany, SBradbury, MJHernandez, LMO'Brien, ZWen, JWang, HHoare, SRPetroski, RESacaan, AMadan, ACrowe, PDBeaton, G Novel benzothiophene H1-antihistamines for the treatment of insomnia. Bioorg Med Chem Lett20:2316-20 (2010) 
 
Histamine H1 receptor
Name:Histamine H1 receptor
Type:G Protein-Coupled Receptor (GPCR)
Mol. Mass.:55808.72
Organism:Homo sapiens (Human)
Description:Cell pellets from SK-N-MC cells transfected with human H1 receptor were used in binding assay.
Residue:487
BDBM50314274
NameBDBM50314274
Synonyms:(-)-(R)-2-(3-(1-(2-methoxypyridin-3-yl)ethyl)benzo[b]thiophen-2-yl)-N,N-dimethylethanamine | CHEMBL1093294
TypeSmall organic molecule
Emp. Form.C20H24N2OS
Mol. Mass.340.482
SMILESCOc1ncccc1[C@@H](C)c1c(CCN(C)C)sc2ccccc12