Reaction Details
TargetC-C chemokine receptor type 5
LigandBDBM50318432
Substrate/Competitorn/a
Meas. Tech.ChEMBL_630265 (CHEMBL1106474)
IC50 12±n/a nM
Citation Rotstein, DMMelville, CRPadilla, FCournoyer, DLee, EKLemoine, RPetersen, ACSetti, LQWanner, JChen, LFilonova, LLoughhead, DGManka, JLin, XFGleason, SSankuratri, SJi, CDerosier, ADioszegi, MHeilek, GJekle, ABerry, PMau, CIWeller, P Novel hexahydropyrrolo[3,4-c]pyrrole CCR5 antagonists. Bioorg Med Chem Lett20:3116-9 (2010) 
 
C-C chemokine receptor type 5
Name:C-C chemokine receptor type 5
Type:Enzyme
Mol. Mass.:40540.21
Organism:Homo sapiens (Human)
Description:P51681
Residue:352
BDBM50318432
NameBDBM50318432
Synonyms:CHEMBL1095827 | N-((S)-3-((3aR,6aS)-5-(6-cyano-2,4-dimethylnicotinoyl)hexahydropyrrolo[3,4-c]pyrrol-2(1H)-yl)-1-phenylpropyl)cyclopentanecarboxamide
TypeSmall organic molecule
Emp. Form.C30H37N5O2
Mol. Mass.499.6471
SMILESCc1cc(nc(C)c1C(=O)N1C[C@@H]2CN(CC[C@H](NC(=O)C3CCCC3)c3ccccc3)C[C@@H]2C1)C#N