Reaction Details
TargetAurora kinase A
LigandBDBM50318571
Substrate/Competitorn/a
Meas. Tech.ChEMBL_633156 (CHEMBL1119040)
IC50 517±n/a nM
Citation Bavetsias, VLarge, JMSun, CBouloc, NKosmopoulou, MMatteucci, MWilsher, NEMartins, VReynisson, JAtrash, BFaisal, AUrban, FValenti, Mde Haven Brandon, ABox, GRaynaud, FIWorkman, PEccles, SABayliss, RBlagg, JLinardopoulos, SMcDonald, E Imidazo[4,5-b]pyridine derivatives as inhibitors of Aurora kinases: lead optimization studies toward the identification of an orally bioavailable preclinical development candidate. J Med Chem53:5213-28 (2010) 
 
Aurora kinase A
Name:Aurora kinase A
Type:Serine/threonine-protein kinase
Mol. Mass.:45830.98
Organism:Homo sapiens (Human)
Description:O14965
Residue:403
BDBM50318571
NameBDBM50318571
Synonyms:2-[4-(6-Bromo-3H-imidazo[4,5-b]pyridin-7-yl)-piperazin-1-yl]-N-thiazol-2-ylacetamide | CHEMBL1086219
TypeSmall organic molecule
Emp. Form.C15H16BrN7OS
Mol. Mass.422.303
SMILESBrc1cnc2nc[nH]c2c1N1CCN(CC(=O)Nc2nccs2)CC1