Reaction Details
TargetMacrophage colony-stimulating factor 1 receptor
LigandBDBM50321356
Substrate/Competitorn/a
Meas. Tech.ChEMBL_640283 (CHEMBL1174608)
IC50 7.1±n/a nM
Citation Wilson, KJIllig, CRChen, JWall, MJBallentine, SKDesJarlais, RLChen, YSchubert, CDonatelli, RPetrounia, ICrysler, CSMolloy, CJChaikin, MAManthey, CLPlayer, MRTomczuk, BEMeegalla, SK Reducing ion channel activity in a series of 4-heterocyclic arylamide FMS inhibitors. Bioorg Med Chem Lett20:3925-9 (2010) 
 
Macrophage colony-stimulating factor 1 receptor
Name:Macrophage colony-stimulating factor 1 receptor
Type:Protein
Mol. Mass.:107979.48
Organism:Homo sapiens (Human)
Description:P07333
Residue:972
BDBM50321356
NameBDBM50321356
Synonyms:2-(4-(4-cyano-1H-imidazole-2-carboxamido)-3-cyclohexenylphenyl)pyridine1-oxide | CHEMBL1172116
TypeSmall organic molecule
Emp. Form.C22H19N5O2
Mol. Mass.385.4186
SMILES[O-][n+]1ccccc1-c1ccc(NC(=O)c2nc(c[nH]2)C#N)c(c1)C1=CCCCC1