Reaction Details
TargetFructose-1,6-bisphosphatase 1
LigandBDBM50322036
Substrate/Competitorn/a
Meas. Tech.ChEMBL_642463 (CHEMBL1175836)
IC50 1±n/a nM
Citation Tsukada, TKanno, OYamane, TTanaka, JYoshida, TOkuno, AShiiki, TTakahashi, MNishi, T Discovery of potent and orally active tricyclic-based FBPase inhibitors. Bioorg Med Chem18:5346-51 (2010) 
 
Fructose-1,6-bisphosphatase 1
Name:Fructose-1,6-bisphosphatase 1
Type:Protein
Mol. Mass.:36843.58
Organism:Homo sapiens (Human)
Description:Liver FBPase (P09467)
Residue:338
BDBM50322036
NameBDBM50322036
Synonyms:CHEMBL1173125 | Ethyl(2S,6S)-4-{[(7-carbamoyl-8H-indeno[1,2-d][1,3]thiazol-4-yl)oxy]methyl}-2,6-dimethyl-7-oxo-8-oxa-3,5-diaza-4-phosphadecan-1-oate4-oxide
TypeSmall organic molecule
Emp. Form.C22H29N4O7PS
Mol. Mass.524.527
SMILESCCOC(=O)[C@H](C)NP(=O)(COc1ccc(C(N)=O)c2Cc3scnc3-c12)N[C@@H](C)C(=O)OCC