Reaction Details
TargetBeta-secretase 1
LigandBDBM50322884
Substrate/Competitorn/a
Meas. Tech.ChEMBL_644686 (CHEMBL1211665)
IC50 5±n/a nM
Citation Clarke, BCutler, LDemont, EDingwall, CDunsdon, RHawkins, JHowes, CHussain, IMaile, GMatico, RMosley, JNaylor, AO'Brien, ARedshaw, SRowland, PSoleil, VSmith, KJSweitzer, STheobald, PVesey, DWalter, DSWayne, G BACE-1 hydroxyethylamine inhibitors using novel edge-to-face interaction with Arg-296. Bioorg Med Chem Lett20:4639-44 (2010) 
 
Beta-secretase 1
Name:Beta-secretase 1
Type:Protein
Mol. Mass.:55755.10
Organism:Homo sapiens (Human)
Description:P56817
Residue:501
BDBM50322884
NameBDBM50322884
Synonyms:CHEMBL1210361 | N-((2S,3R)-3-hydroxy-1-phenyl-4-(3-(trifluoromethyl)benzylamino)butan-2-yl)-3-isopropyl-5-(N-phenylmethylsulfonamido)benzamide
TypeSmall organic molecule
Emp. Form.C35H38F3N3O4S
Mol. Mass.653.754
SMILESCC(C)c1cc(cc(c1)C(=O)N[C@@H](Cc1ccccc1)[C@H](O)CNCc1cccc(c1)C(F)(F)F)N(c1ccccc1)S(C)(=O)=O