Reaction Details
TargetBeta-secretase 1
LigandBDBM50322882
Substrate/Competitorn/a
Meas. Tech.ChEMBL_644686 (CHEMBL1211665)
IC50 3±n/a nM
Citation Clarke, BCutler, LDemont, EDingwall, CDunsdon, RHawkins, JHowes, CHussain, IMaile, GMatico, RMosley, JNaylor, AO'Brien, ARedshaw, SRowland, PSoleil, VSmith, KJSweitzer, STheobald, PVesey, DWalter, DSWayne, G BACE-1 hydroxyethylamine inhibitors using novel edge-to-face interaction with Arg-296. Bioorg Med Chem Lett20:4639-44 (2010) 
 
Beta-secretase 1
Name:Beta-secretase 1
Type:Protein
Mol. Mass.:55755.10
Organism:Homo sapiens (Human)
Description:P56817
Residue:501
BDBM50322882
NameBDBM50322882
Synonyms:CHEMBL1210359 N-((2S,3R)-4-((S)-1-(cyclohexylamino)-1-oxopropan-2-ylamino)-3-hydroxy-1-phenylbutan-2-yl)-3-(ethylamino)-5-(N-phenylmethylsulfonamido)benzamide
TypeSmall organic molecule
Emp. Form.C35H47N5O5S
Mol. Mass.649.843
SMILESCCNc1cc(cc(c1)C(=O)N[C@@H](Cc1ccccc1)[C@H](O)CN[C@@H](C)C(=O)NC1CCCCC1)N(c1ccccc1)S(C)(=O)=O